# Build failed after adding SDK

**URL:** <https://devforum.zoom.us/t/build-failed-after-adding-sdk/61371>\
**Category:** Meeting SDK\
**Created:** [December 13, 2021, 9:50am UTC](https://devforum.zoom.us/t/build-failed-after-adding-sdk/61371 "2021-12-13T09:50:28Z")\
**Posts on this page:** 6\
**Page:** 1

<div class="post-metadata">

**Author:** ![saurabhkanswal8101](https://sea2.discourse-cdn.com/flex016/user_avatar/devforum.zoom.us/saurabhkanswal8101/32/33289_2.png) [@saurabhkanswal8101](https://devforum.zoom.us/u/saurabhkanswal8101)\
**Post date:** [December 13, 2021, 9:50am UTC](https://devforum.zoom.us/t/build-failed-after-adding-sdk/61371/1 "2021-12-13T09:50:28Z")

</div>

I have followed the documentation to add android meeting SDK into an app.  
As mentioned in documentation I have added a both aar files.

to confirm it I have check my build.gradle and below 2 line are in there.

```auto
implementation project(path: ':commonlib')
implementation project(path: ':mobilertc')

```

But I am getting an failure when I tried to run my app.

```auto
FAILURE: Build completed with 7 failures.

1: Task failed with an exception.
-----------
* What went wrong:
Execution failed for task ':app:checkDebugAarMetadata'.
> Could not resolve all files for configuration ':app:debugRuntimeClasspath'.
   > Could not find com.google.android.exoplayer:exoplayer-core:2.12.3.
     Searched in the following locations:
       - https://repo.maven.apache.org/maven2/com/google/android/exoplayer/exoplayer-core/2.12.3/exoplayer-core-2.12.3.pom
       - file:/Users/saurabhkanswal/.m2/repository/com/google/android/exoplayer/exoplayer-core/2.12.3/exoplayer-core-2.12.3.pom
       - file:/Users/saurabhkanswal/and/zoomProto/node_modules/react-native/android/com/google/android/exoplayer/exoplayer-core/2.12.3/exoplayer-core-2.12.3.pom
       - file:/Users/saurabhkanswal/and/zoomProto/node_modules/jsc-android/dist/com/google/android/exoplayer/exoplayer-core/2.12.3/exoplayer-core-2.12.3.pom
       - https://dl.google.com/dl/android/maven2/com/google/android/exoplayer/exoplayer-core/2.12.3/exoplayer-core-2.12.3.pom
       - https://www.jitpack.io/com/google/android/exoplayer/exoplayer-core/2.12.3/exoplayer-core-2.12.3.pom
     Required by:
         project :app > project :mobilertc
   > Could not find com.google.android.exoplayer:exoplayer-ui:2.12.3.

```

Any idea how to resolve this error.

---

<div class="post-metadata">

**Author:** ![jon.zoom](https://sea2.discourse-cdn.com/flex016/user_avatar/devforum.zoom.us/jon.zoom/32/13495_2.png) [@jon.zoom](https://devforum.zoom.us/u/jon.zoom)\
**Post date:** [December 13, 2021, 7:41pm UTC](https://devforum.zoom.us/t/build-failed-after-adding-sdk/61371/2 "2021-12-13T19:41:44Z")

</div>

Hi @saurabhkanswal8101, thanks for using our SDK.

It seems that the dependencies used by the SDK were not added to your `mobilertc/build.gradle` file after the AAR was added. Please add the below dependencies to that file to resolve this error.

```auto
dependencies.add("default","androidx.security:security-crypto:1.1.0-alpha02")
dependencies.add("default","com.google.crypto.tink:tink-android:1.5.0")
dependencies.add("default","com.google.android.exoplayer:exoplayer-core:2.12.3")
dependencies.add("default","com.google.android.exoplayer:exoplayer-ui:2.12.3")
dependencies.add("default","androidx.swiperefreshlayout:swiperefreshlayout:1.0.0")

dependencies.add("default","androidx.appcompat:appcompat:1.0.0")
dependencies.add("default","androidx.constraintlayout:constraintlayout:2.0.4")
dependencies.add("default","com.google.android.material:material:1.2.0-alpha03")
dependencies.add("default","com.google.android:flexbox:2.0.1")
dependencies.add("default","androidx.multidex:multidex:2.0.0")
dependencies.add("default","com.google.code.gson:gson:2.8.1")
dependencies.add("default","com.github.bumptech.glide:annotations:4.11.0")
dependencies.add("default","com.github.bumptech.glide:glide:4.11.0")

dependencies.add("default","androidx.recyclerview:recyclerview:1.0.0")

```

Thanks!

---

<div class="post-metadata">

**Author:** ![saurabhkanswal8101](https://sea2.discourse-cdn.com/flex016/user_avatar/devforum.zoom.us/saurabhkanswal8101/32/33289_2.png) [@saurabhkanswal8101](https://devforum.zoom.us/u/saurabhkanswal8101)\
**Post date:** [December 13, 2021, 9:26pm UTC](https://devforum.zoom.us/t/build-failed-after-adding-sdk/61371/3 "2021-12-13T21:26:07Z")

</div>

I checked inside `mobilertc/build.gradle`  
all the dependency you mentioned are in there.

---

<div class="post-metadata">

**Author:** ![saurabhkanswal8101](https://sea2.discourse-cdn.com/flex016/user_avatar/devforum.zoom.us/saurabhkanswal8101/32/33289_2.png) [@saurabhkanswal8101](https://devforum.zoom.us/u/saurabhkanswal8101)\
**Post date:** [December 13, 2021, 9:29pm UTC](https://devforum.zoom.us/t/build-failed-after-adding-sdk/61371/4 "2021-12-13T21:29:19Z")

</div>

Below are the task which are being failed:

> Task :app:generatePackageList  
> Task :app:preBuild  
> Task :app:preDebugBuild  
> Task :app:generateDebugBuildConfig UP-TO-DATE  
> Task :app:javaPreCompileDebug UP-TO-DATE  
> Task :app:bundleDebugJsAndAssets SKIPPED  
> Task :app:mergeDebugShaders UP-TO-DATE  
> Task :app:compileDebugAidl NO-SOURCE  
> Task :app:compileDebugShaders NO-SOURCE  
> Task :app:generateDebugAssets UP-TO-DATE  
> Task :app:generateDebugResValues UP-TO-DATE  
> Task :app:createDebugCompatibleScreenManifests UP-TO-DATE  
> Task :app:extractDeepLinksDebug UP-TO-DATE  
> Task :app:mergeDebugNativeDebugMetadata NO-SOURCE  
> Task :app:compileDebugRenderscript NO-SOURCE  
> Task :app:checkDebugAarMetadata FAILED  
> Task :app:generateDebugResources UP-TO-DATE  
> Task :app:processDebugJavaRes NO-SOURCE  
> Task :app:mergeDebugAssets FAILED  
> Task :app:processDebugMainManifest FAILED  
> Task :app:checkDebugDuplicateClasses FAILED  
> Task :app:mergeDebugJavaResource FAILED  
> Task :app:desugarDebugFileDependencies FAILED  
> Task :app:mergeDebugJniLibFolders UP-TO-DATE  
> Task :app:validateSigningDebug UP-TO-DATE  
> Task :app:writeDebugAppMetadata UP-TO-DATE  
> Task :app:writeDebugSigningConfigVersions UP-TO-DATE  
> Task :app:mergeDebugNativeLibs FAILED

Also want to let you know, I am implementing zoom sdk with my react native project.

---

<div class="post-metadata">

**Author:** ![jon.zoom](https://sea2.discourse-cdn.com/flex016/user_avatar/devforum.zoom.us/jon.zoom/32/13495_2.png) [@jon.zoom](https://devforum.zoom.us/u/jon.zoom)\
**Post date:** [December 14, 2021, 1:09am UTC](https://devforum.zoom.us/t/build-failed-after-adding-sdk/61371/5 "2021-12-14T01:09:25Z")

</div>

Hi @saurabhkanswal8101,

Thanks for confirming that you have added these dependencies and that you have a React Native project. Since this is a build issue likely related to your React Native environment, we are extremely limited in how we can assist due to the fact that we do not currently support React Native for the Meeting SDK. Please let me know if you are able to reproduce this issue in a native Android project and I will be happy to assist further. 🙂

Thanks!

---

<div class="post-metadata">

**Author:** ![system](https://us1.discourse-cdn.com/flex016/uploads/zoomdeveloper/original/3X/6/1/614bdd549b610bbaa46ff934617683a02bdaa03c.png) [@system](https://devforum.zoom.us/u/system)\
**Post date:** [January 13, 2022, 11:09am UTC](https://devforum.zoom.us/t/build-failed-after-adding-sdk/61371/6 "2022-01-13T11:09:51Z")

</div>

This topic was automatically closed 30 days after the last reply. New replies are no longer allowed.
