# Run Zoom on Ionic 4

**URL:** <https://devforum.zoom.us/t/run-zoom-on-ionic-4/4250>\
**Category:** Meeting SDK\
**Created:** [May 14, 2019, 9:44pm UTC](https://devforum.zoom.us/t/run-zoom-on-ionic-4/4250 "2019-05-14T21:44:17Z")\
**Posts on this page:** 20\
**Page:** 1

<div class="post-metadata">

**Author:** ![zeusstl](https://avatars.discourse-cdn.com/v4/letter/z/d9b06d/32.png) [@zeusstl](https://devforum.zoom.us/u/zeusstl)\
**Post date:** [May 14, 2019, 9:44pm UTC](https://devforum.zoom.us/t/run-zoom-on-ionic-4/4250/1 "2019-05-14T21:44:17Z")

</div>

**Description**

1. Is there any plan to make the Zoom mobile sdk compatible with Ionic 4 (and/or Capacitor)? (Perhaps it already works?)
2. Is it possible to use the web sdk in Ionic (until the mobile sdk becomes compatible with Ionic 4)?
3. Or can you recommend some other method that can be used to get Zoom running on Ionic 4?

---

<div class="post-metadata">

**Author:** ![carson.zoom](https://sea2.discourse-cdn.com/flex016/user_avatar/devforum.zoom.us/carson.zoom/32/785_2.png) [@carson.zoom](https://devforum.zoom.us/u/carson.zoom)\
**Post date:** [May 14, 2019, 10:03pm UTC](https://devforum.zoom.us/t/run-zoom-on-ionic-4/4250/2 "2019-05-14T22:03:52Z")

</div>

Hi zeusstl,  
Thanks for using Zoom SDK. Regarding your questions:

1. We do have an Ionic SDK:

- [https://marketplace.zoom.us/docs/sdk/hybrid-frameworks/ionic](https://marketplace.zoom.us/docs/sdk/hybrid-frameworks/ionic)
- [https://github.com/zoom/zoom-sdk-ionic](https://github.com/zoom/zoom-sdk-ionic)
- [https://github.com/zoom/sample-app-ionic](https://github.com/zoom/sample-app-ionic)  
But it is developed based on Ionic 3. It has not been tested with Ionic 4. Ideally, it should work with Ionic 4 as well. Please let us know if you encounter any errors.

1. Our Web SDK is designed and optimized for the web browser. It has not been tested with Ionic as well.

Let me know if you have any questions. Thanks!

---

<div class="post-metadata">

**Author:** ![zeusstl](https://avatars.discourse-cdn.com/v4/letter/z/d9b06d/32.png) [@zeusstl](https://devforum.zoom.us/u/zeusstl)\
**Post date:** [May 15, 2019, 5:21am UTC](https://devforum.zoom.us/t/run-zoom-on-ionic-4/4250/3 "2019-05-15T05:21:05Z")

</div>

Thanks for the response.

It looks like there are a few errors when running on ionic 4. I’ve included the errors from IOS and from ANDROID below.

**IOS**

There was one main set of errors when running on ios:

```
Ld /Users/user/Library/Developer/Xcode/DerivedData/App-apifxegyoqlwjjcgvvyjbjgtaszk/Build/Products/Debug-iphonesimulator/CordovaPlugins/CordovaPlugins.framework/CordovaPlugins normal x86_64 (in target: CordovaPlugins)
    cd /Users/user/project-folder/ios/App/Pods
    export IPHONEOS_DEPLOYMENT_TARGET=11.0
    /Applications/Xcode.app/Contents/Developer/Toolchains/XcodeDefault.xctoolchain/usr/bin/clang -arch x86_64 -dynamiclib -isysroot /Applications/Xcode.app/Contents/Developer/Platforms/iPhoneSimulator.platform/Developer/SDKs/iPhoneSimulator12.2.sdk -L/Users/user/Library/Developer/Xcode/DerivedData/App-apifxegyoqlwjjcgvvyjbjgtaszk/Build/Products/Debug-iphonesimulator/CordovaPlugins -F/Users/user/Library/Developer/Xcode/DerivedData/App-apifxegyoqlwjjcgvvyjbjgtaszk/Build/Products/Debug-iphonesimulator/CordovaPlugins -F/Users/user/Library/Developer/Xcode/DerivedData/App-apifxegyoqlwjjcgvvyjbjgtaszk/Build/Products/Debug-iphonesimulator/CapacitorCordova -F/Users/user/project-folder/ios/App/Pods/../../capacitor-cordova-ios-plugins/sources/Cordova.plugin.zoom/libs/ios -filelist /Users/user/Library/Developer/Xcode/DerivedData/App-apifxegyoqlwjjcgvvyjbjgtaszk/Build/Intermediates.noindex/Pods.build/Debug-iphonesimulator/CordovaPlugins.build/Objects-normal/x86_64/CordovaPlugins.LinkFileList -install_name @rpath/CordovaPlugins.framework/CordovaPlugins -Xlinker -rpath -Xlinker @executable_path/Frameworks -Xlinker -rpath -Xlinker @loader_path/Frameworks -mios-simulator-version-min=11.0 -dead_strip -Xlinker -object_path_lto -Xlinker /Users/user/Library/Developer/Xcode/DerivedData/App-apifxegyoqlwjjcgvvyjbjgtaszk/Build/Intermediates.noindex/Pods.build/Debug-iphonesimulator/CordovaPlugins.build/Objects-normal/x86_64/CordovaPlugins_lto.o -Xlinker -export_dynamic -Xlinker -no_deduplicate -Xlinker -objc_abi_version -Xlinker 2 -fobjc-arc -fobjc-link-runtime -framework AssetsLibrary -framework MobileCoreServices -framework AssetsLibrary -framework Cordova -framework Foundation -framework MobileCoreServices -compatibility_version 1 -current_version 1 -Xlinker -dependency_info -Xlinker /Users/user/Library/Developer/Xcode/DerivedData/App-apifxegyoqlwjjcgvvyjbjgtaszk/Build/Intermediates.noindex/Pods.build/Debug-iphonesimulator/CordovaPlugins.build/Objects-normal/x86_64/CordovaPlugins_dependency_info.dat -o /Users/user/Library/Developer/Xcode/DerivedData/App-apifxegyoqlwjjcgvvyjbjgtaszk/Build/Products/Debug-iphonesimulator/CordovaPlugins/CordovaPlugins.framework/CordovaPlugins

ld: warning: Could not find auto-linked framework 'MobileRTC'
Undefined symbols for architecture x86_64:
  "_OBJC_CLASS_$_MobileRTCMeetingStartParam4LoginlUser", referenced from:
      objc-class-ref in Zoom.o
  "_OBJC_CLASS_$_MobileRTC", referenced from:
      objc-class-ref in Zoom.o
  "_kMeetingParam_Username", referenced from:
      ___20-[Zoom joinMeeting:]_block_invoke in Zoom.o
  "_kMeetingParam_MeetingPassword", referenced from:
      ___20-[Zoom joinMeeting:]_block_invoke in Zoom.o
  "_OBJC_CLASS_$_MobileRTCMeetingStartParam4WithoutLoginUser", referenced from:
      objc-class-ref in Zoom.o
  "_kMeetingParam_MeetingNumber", referenced from:
      ___20-[Zoom joinMeeting:]_block_invoke in Zoom.o
ld: symbol(s) not found for architecture x86_64
clang: error: linker command failed with exit code 1 (use -v to see invocation)

**Showing All Errors Only**

:-1: Undefined symbol: _OBJC_CLASS_$_MobileRTCMeetingStartParam4LoginlUser

:-1: Undefined symbol: _OBJC_CLASS_$_MobileRTC

:-1: Undefined symbol: _kMeetingParam_Username

:-1: Undefined symbol: _kMeetingParam_MeetingPassword

:-1: Undefined symbol: _OBJC_CLASS_$_MobileRTCMeetingStartParam4WithoutLoginUser

:-1: Undefined symbol: _kMeetingParam_MeetingNumber

```

**ANDROID**

And these are the Android errors:

```
org.gradle.execution.MultipleBuildFailures: Build completed with 1 failures.
	at org.gradle.initialization.DefaultGradleLauncher$ExecuteTasks.run(DefaultGradleLauncher.java:386)
	at org.gradle.internal.operations.DefaultBuildOperationExecutor$RunnableBuildOperationWorker.execute(DefaultBuildOperationExecutor.java:301)
	at org.gradle.internal.operations.DefaultBuildOperationExecutor$RunnableBuildOperationWorker.execute(DefaultBuildOperationExecutor.java:293)
	at org.gradle.internal.operations.DefaultBuildOperationExecutor.execute(DefaultBuildOperationExecutor.java:175)
	at org.gradle.internal.operations.DefaultBuildOperationExecutor.run(DefaultBuildOperationExecutor.java:91)
	at org.gradle.internal.operations.DelegatingBuildOperationExecutor.run(DelegatingBuildOperationExecutor.java:31)
	at org.gradle.initialization.DefaultGradleLauncher.runTasks(DefaultGradleLauncher.java:247)
	at org.gradle.initialization.DefaultGradleLauncher.doBuildStages(DefaultGradleLauncher.java:159)
	at org.gradle.initialization.DefaultGradleLauncher.executeTasks(DefaultGradleLauncher.java:134)
	at org.gradle.internal.invocation.GradleBuildController$1.execute(GradleBuildController.java:58)
	at org.gradle.internal.invocation.GradleBuildController$1.execute(GradleBuildController.java:55)
	at org.gradle.internal.invocation.GradleBuildController$3.create(GradleBuildController.java:82)
	at org.gradle.internal.invocation.GradleBuildController$3.create(GradleBuildController.java:75)
	at org.gradle.internal.work.DefaultWorkerLeaseService.withLocks(DefaultWorkerLeaseService.java:183)
	at org.gradle.internal.work.StopShieldingWorkerLeaseService.withLocks(StopShieldingWorkerLeaseService.java:40)
	at org.gradle.internal.invocation.GradleBuildController.doBuild(GradleBuildController.java:75)
	at org.gradle.internal.invocation.GradleBuildController.run(GradleBuildController.java:55)
	at org.gradle.tooling.internal.provider.runner.ClientProvidedBuildActionRunner.run(ClientProvidedBuildActionRunner.java:55)
	at org.gradle.launcher.exec.ChainingBuildActionRunner.run(ChainingBuildActionRunner.java:35)
	at org.gradle.launcher.exec.ChainingBuildActionRunner.run(ChainingBuildActionRunner.java:35)
	at org.gradle.launcher.exec.BuildOutcomeReportingBuildActionRunner.run(BuildOutcomeReportingBuildActionRunner.java:58)
	at org.gradle.tooling.internal.provider.ValidatingBuildActionRunner.run(ValidatingBuildActionRunner.java:32)
	at org.gradle.launcher.exec.BuildCompletionNotifyingBuildActionRunner.run(BuildCompletionNotifyingBuildActionRunner.java:39)
	at org.gradle.launcher.exec.RunAsBuildOperationBuildActionRunner$3.call(RunAsBuildOperationBuildActionRunner.java:49)
	at org.gradle.launcher.exec.RunAsBuildOperationBuildActionRunner$3.call(RunAsBuildOperationBuildActionRunner.java:44)
	at org.gradle.internal.operations.DefaultBuildOperationExecutor$CallableBuildOperationWorker.execute(DefaultBuildOperationExecutor.java:315)
	at org.gradle.internal.operations.DefaultBuildOperationExecutor$CallableBuildOperationWorker.execute(DefaultBuildOperationExecutor.java:305)
	at org.gradle.internal.operations.DefaultBuildOperationExecutor.execute(DefaultBuildOperationExecutor.java:175)
	at org.gradle.internal.operations.DefaultBuildOperationExecutor.call(DefaultBuildOperationExecutor.java:101)
	at org.gradle.internal.operations.DelegatingBuildOperationExecutor.call(DelegatingBuildOperationExecutor.java:36)
	at org.gradle.launcher.exec.RunAsBuildOperationBuildActionRunner.run(RunAsBuildOperationBuildActionRunner.java:44)
	at org.gradle.launcher.exec.InProcessBuildActionExecuter$1.transform(InProcessBuildActionExecuter.java:49)
	at org.gradle.launcher.exec.InProcessBuildActionExecuter$1.transform(InProcessBuildActionExecuter.java:46)
	at org.gradle.composite.internal.DefaultRootBuildState.run(DefaultRootBuildState.java:78)
	at org.gradle.launcher.exec.InProcessBuildActionExecuter.execute(InProcessBuildActionExecuter.java:46)
	at org.gradle.launcher.exec.InProcessBuildActionExecuter.execute(InProcessBuildActionExecuter.java:31)
	at org.gradle.launcher.exec.BuildTreeScopeBuildActionExecuter.execute(BuildTreeScopeBuildActionExecuter.java:42)
	at org.gradle.launcher.exec.BuildTreeScopeBuildActionExecuter.execute(BuildTreeScopeBuildActionExecuter.java:28)
	at org.gradle.tooling.internal.provider.ContinuousBuildActionExecuter.execute(ContinuousBuildActionExecuter.java:78)
	at org.gradle.tooling.internal.provider.ContinuousBuildActionExecuter.execute(ContinuousBuildActionExecuter.java:52)
	at org.gradle.tooling.internal.provider.SubscribableBuildActionExecuter.execute(SubscribableBuildActionExecuter.java:59)
	at org.gradle.tooling.internal.provider.SubscribableBuildActionExecuter.execute(SubscribableBuildActionExecuter.java:36)
	at org.gradle.tooling.internal.provider.SessionScopeBuildActionExecuter.execute(SessionScopeBuildActionExecuter.java:68)
	at org.gradle.tooling.internal.provider.SessionScopeBuildActionExecuter.execute(SessionScopeBuildActionExecuter.java:38)
	at org.gradle.tooling.internal.provider.GradleThreadBuildActionExecuter.execute(GradleThreadBuildActionExecuter.java:37)
	at org.gradle.tooling.internal.provider.GradleThreadBuildActionExecuter.execute(GradleThreadBuildActionExecuter.java:26)
	at org.gradle.tooling.internal.provider.ParallelismConfigurationBuildActionExecuter.execute(ParallelismConfigurationBuildActionExecuter.java:43)
	at org.gradle.tooling.internal.provider.ParallelismConfigurationBuildActionExecuter.execute(ParallelismConfigurationBuildActionExecuter.java:29)
	at org.gradle.tooling.internal.provider.StartParamsValidatingActionExecuter.execute(StartParamsValidatingActionExecuter.java:60)
	at org.gradle.tooling.internal.provider.StartParamsValidatingActionExecuter.execute(StartParamsValidatingActionExecuter.java:32)
	at org.gradle.tooling.internal.provider.SessionFailureReportingActionExecuter.execute(SessionFailureReportingActionExecuter.java:55)
	at org.gradle.tooling.internal.provider.SessionFailureReportingActionExecuter.execute(SessionFailureReportingActionExecuter.java:41)
	at org.gradle.tooling.internal.provider.SetupLoggingActionExecuter.execute(SetupLoggingActionExecuter.java:48)
	at org.gradle.tooling.internal.provider.SetupLoggingActionExecuter.execute(SetupLoggingActionExecuter.java:32)
	at org.gradle.launcher.daemon.server.exec.ExecuteBuild.doBuild(ExecuteBuild.java:67)
	at org.gradle.launcher.daemon.server.exec.BuildCommandOnly.execute(BuildCommandOnly.java:36)
	at org.gradle.launcher.daemon.server.api.DaemonCommandExecution.proceed(DaemonCommandExecution.java:104)
	at org.gradle.launcher.daemon.server.exec.WatchForDisconnection.execute(WatchForDisconnection.java:37)
	at org.gradle.launcher.daemon.server.api.DaemonCommandExecution.proceed(DaemonCommandExecution.java:104)
	at org.gradle.launcher.daemon.server.exec.ResetDeprecationLogger.execute(ResetDeprecationLogger.java:26)
	at org.gradle.launcher.daemon.server.api.DaemonCommandExecution.proceed(DaemonCommandExecution.java:104)
	at org.gradle.launcher.daemon.server.exec.RequestStopIfSingleUsedDaemon.execute(RequestStopIfSingleUsedDaemon.java:34)
	at org.gradle.launcher.daemon.server.api.DaemonCommandExecution.proceed(DaemonCommandExecution.java:104)
	at org.gradle.launcher.daemon.server.exec.ForwardClientInput$2.call(ForwardClientInput.java:74)
	at org.gradle.launcher.daemon.server.exec.ForwardClientInput$2.call(ForwardClientInput.java:72)
	at org.gradle.util.Swapper.swap(Swapper.java:38)
	at org.gradle.launcher.daemon.server.exec.ForwardClientInput.execute(ForwardClientInput.java:72)
	at org.gradle.launcher.daemon.server.api.DaemonCommandExecution.proceed(DaemonCommandExecution.java:104)
	at org.gradle.launcher.daemon.server.exec.LogAndCheckHealth.execute(LogAndCheckHealth.java:55)
	at org.gradle.launcher.daemon.server.api.DaemonCommandExecution.proceed(DaemonCommandExecution.java:104)
	at org.gradle.launcher.daemon.server.exec.LogToClient.doBuild(LogToClient.java:62)
	at org.gradle.launcher.daemon.server.exec.BuildCommandOnly.execute(BuildCommandOnly.java:36)
	at org.gradle.launcher.daemon.server.api.DaemonCommandExecution.proceed(DaemonCommandExecution.java:104)
	at org.gradle.launcher.daemon.server.exec.EstablishBuildEnvironment.doBuild(EstablishBuildEnvironment.java:81)
	at org.gradle.launcher.daemon.server.exec.BuildCommandOnly.execute(BuildCommandOnly.java:36)
	at org.gradle.launcher.daemon.server.api.DaemonCommandExecution.proceed(DaemonCommandExecution.java:104)
	at org.gradle.launcher.daemon.server.exec.StartBuildOrRespondWithBusy$1.run(StartBuildOrRespondWithBusy.java:50)
	at org.gradle.launcher.daemon.server.DaemonStateCoordinator$1.run(DaemonStateCoordinator.java:295)
	at org.gradle.internal.concurrent.ExecutorPolicy$CatchAndRecordFailures.onExecute(ExecutorPolicy.java:63)
	at org.gradle.internal.concurrent.ManagedExecutorImpl$1.run(ManagedExecutorImpl.java:46)
	at java.util.concurrent.ThreadPoolExecutor.runWorker(ThreadPoolExecutor.java:1142)
	at java.util.concurrent.ThreadPoolExecutor$Worker.run(ThreadPoolExecutor.java:617)
	at org.gradle.internal.concurrent.ThreadFactoryImpl$ManagedThreadRunnable.run(ThreadFactoryImpl.java:55)
	at java.lang.Thread.run(Thread.java:745)
Caused by: org.gradle.api.tasks.TaskExecutionException: Execution failed for task ':app:preDebugBuild'.
	at org.gradle.api.internal.tasks.execution.CatchExceptionTaskExecuter.execute(CatchExceptionTaskExecuter.java:38)
	at org.gradle.api.internal.tasks.execution.EventFiringTaskExecuter$1.executeTask(EventFiringTaskExecuter.java:67)
	at org.gradle.api.internal.tasks.execution.EventFiringTaskExecuter$1.call(EventFiringTaskExecuter.java:52)
	at org.gradle.api.internal.tasks.execution.EventFiringTaskExecuter$1.call(EventFiringTaskExecuter.java:49)
	at org.gradle.internal.operations.DefaultBuildOperationExecutor$CallableBuildOperationWorker.execute(DefaultBuildOperationExecutor.java:315)
	at org.gradle.internal.operations.DefaultBuildOperationExecutor$CallableBuildOperationWorker.execute(DefaultBuildOperationExecutor.java:305)
	at org.gradle.internal.operations.DefaultBuildOperationExecutor.execute(DefaultBuildOperationExecutor.java:175)
	at org.gradle.internal.operations.DefaultBuildOperationExecutor.call(DefaultBuildOperationExecutor.java:101)
	at org.gradle.internal.operations.DelegatingBuildOperationExecutor.call(DelegatingBuildOperationExecutor.java:36)
	at org.gradle.api.internal.tasks.execution.EventFiringTaskExecuter.execute(EventFiringTaskExecuter.java:49)
	at org.gradle.execution.plan.LocalTaskNodeExecutor.execute(LocalTaskNodeExecutor.java:43)
	at org.gradle.execution.taskgraph.DefaultTaskExecutionGraph$InvokeNodeExecutorsAction.execute(DefaultTaskExecutionGraph.java:355)
	at org.gradle.execution.taskgraph.DefaultTaskExecutionGraph$InvokeNodeExecutorsAction.execute(DefaultTaskExecutionGraph.java:343)
	at org.gradle.execution.taskgraph.DefaultTaskExecutionGraph$BuildOperationAwareExecutionAction.execute(DefaultTaskExecutionGraph.java:336)
	at org.gradle.execution.taskgraph.DefaultTaskExecutionGraph$BuildOperationAwareExecutionAction.execute(DefaultTaskExecutionGraph.java:322)
	at org.gradle.execution.plan.DefaultPlanExecutor$ExecutorWorker$1.execute(DefaultPlanExecutor.java:134)
	at org.gradle.execution.plan.DefaultPlanExecutor$ExecutorWorker$1.execute(DefaultPlanExecutor.java:129)
	at org.gradle.execution.plan.DefaultPlanExecutor$ExecutorWorker.execute(DefaultPlanExecutor.java:202)
	at org.gradle.execution.plan.DefaultPlanExecutor$ExecutorWorker.executeNextNode(DefaultPlanExecutor.java:193)
	at org.gradle.execution.plan.DefaultPlanExecutor$ExecutorWorker.run(DefaultPlanExecutor.java:129)
	... 6 more
Caused by: org.gradle.api.internal.artifacts.ivyservice.DefaultLenientConfiguration$ArtifactResolveException: Could not resolve all files for configuration ':app:debugCompileClasspath'.
	at org.gradle.api.internal.artifacts.configurations.DefaultConfiguration.rethrowFailure(DefaultConfiguration.java:1175)
	at org.gradle.api.internal.artifacts.configurations.DefaultConfiguration.access$2100(DefaultConfiguration.java:135)
	at org.gradle.api.internal.artifacts.configurations.DefaultConfiguration$ConfigurationFileCollection.getFiles(DefaultConfiguration.java:1150)
	at org.gradle.api.internal.file.AbstractFileCollection.iterator(AbstractFileCollection.java:72)
	at org.gradle.internal.snapshot.impl.DefaultFileSystemSnapshotter$FileCollectionLeafVisitorImpl.visitCollection(DefaultFileSystemSnapshotter.java:240)
	at org.gradle.api.internal.file.AbstractFileCollection.visitLeafCollections(AbstractFileCollection.java:233)
	at org.gradle.api.internal.file.CompositeFileCollection.visitLeafCollections(CompositeFileCollection.java:205)
	at org.gradle.internal.snapshot.impl.DefaultFileSystemSnapshotter.snapshot(DefaultFileSystemSnapshotter.java:126)
	at org.gradle.internal.fingerprint.impl.AbstractFileCollectionFingerprinter.fingerprint(AbstractFileCollectionFingerprinter.java:47)
	at org.gradle.internal.fingerprint.impl.AbstractPathOnlyFileCollectionFingerprinter.fingerprint(AbstractPathOnlyFileCollectionFingerprinter.java:36)
	at org.gradle.api.internal.changedetection.changes.TaskFingerprintUtil.fingerprintTaskFiles(TaskFingerprintUtil.java:82)
	at org.gradle.api.internal.changedetection.state.CacheBackedTaskHistoryRepository.createExecution(CacheBackedTaskHistoryRepository.java:123)
	at org.gradle.api.internal.changedetection.state.CacheBackedTaskHistoryRepository.access$100(CacheBackedTaskHistoryRepository.java:46)
	at org.gradle.api.internal.changedetection.state.CacheBackedTaskHistoryRepository$1.getBeforeExecutionState(CacheBackedTaskHistoryRepository.java:86)
	at org.gradle.api.internal.changedetection.changes.DefaultTaskArtifactStateRepository$TaskArtifactStateImpl.getExecutionStateChanges(DefaultTaskArtifactStateRepository.java:189)
	at org.gradle.api.internal.tasks.execution.ExecuteActionsTaskExecuter$TaskExecution.getChangesSincePreviousExecution(ExecuteActionsTaskExecuter.java:182)
	at org.gradle.internal.execution.impl.steps.SkipUpToDateStep.execute(SkipUpToDateStep.java:52)
	at org.gradle.internal.execution.impl.steps.SkipUpToDateStep.execute(SkipUpToDateStep.java:36)
	at org.gradle.internal.execution.impl.DefaultWorkExecutor.execute(DefaultWorkExecutor.java:34)
	at org.gradle.api.internal.tasks.execution.ExecuteActionsTaskExecuter.execute(ExecuteActionsTaskExecuter.java:91)
	at org.gradle.api.internal.tasks.execution.ResolveTaskOutputCachingStateExecuter.execute(ResolveTaskOutputCachingStateExecuter.java:91)
	at org.gradle.api.internal.tasks.execution.ValidatingTaskExecuter.execute(ValidatingTaskExecuter.java:57)
	at org.gradle.api.internal.tasks.execution.SkipEmptySourceFilesTaskExecuter.execute(SkipEmptySourceFilesTaskExecuter.java:119)
	at org.gradle.api.internal.tasks.execution.ResolvePreviousStateExecuter.execute(ResolvePreviousStateExecuter.java:43)
	at org.gradle.api.internal.tasks.execution.CleanupStaleOutputsExecuter.execute(CleanupStaleOutputsExecuter.java:93)
	at org.gradle.api.internal.tasks.execution.FinalizePropertiesTaskExecuter.execute(FinalizePropertiesTaskExecuter.java:45)
	at org.gradle.api.internal.tasks.execution.ResolveTaskArtifactStateTaskExecuter.execute(ResolveTaskArtifactStateTaskExecuter.java:94)
	at org.gradle.api.internal.tasks.execution.SkipTaskWithNoActionsExecuter.execute(SkipTaskWithNoActionsExecuter.java:56)
	at org.gradle.api.internal.tasks.execution.SkipOnlyIfTaskExecuter.execute(SkipOnlyIfTaskExecuter.java:55)
	at org.gradle.api.internal.tasks.execution.CatchExceptionTaskExecuter.execute(CatchExceptionTaskExecuter.java:36)
	... 25 more
Caused by: org.gradle.internal.resolve.ModuleVersionNotFoundException: Could not find :commonlib:.
Required by:
    project :app
    project :app > project :capacitor-cordova-android-plugins
	at org.gradle.internal.resolve.result.DefaultBuildableComponentResolveResult.notFound(DefaultBuildableComponentResolveResult.java:42)
	at org.gradle.api.internal.artifacts.ivyservice.ivyresolve.RepositoryChainComponentMetaDataResolver.resolveModule(RepositoryChainComponentMetaDataResolver.java:108)
	at org.gradle.api.internal.artifacts.ivyservice.ivyresolve.RepositoryChainComponentMetaDataResolver.resolve(RepositoryChainComponentMetaDataResolver.java:63)
	at org.gradle.api.internal.artifacts.ivyservice.resolveengine.ComponentResolversChain$ComponentMetaDataResolverChain.resolve(ComponentResolversChain.java:95)
	at org.gradle.api.internal.artifacts.ivyservice.clientmodule.ClientModuleResolver.resolve(ClientModuleResolver.java:63)
	at org.gradle.api.internal.artifacts.ivyservice.resolveengine.graph.builder.ComponentState.resolve(ComponentState.java:193)
	at org.gradle.api.internal.artifacts.ivyservice.resolveengine.graph.builder.ComponentState.getMetadata(ComponentState.java:143)
	at org.gradle.api.internal.artifacts.ivyservice.resolveengine.graph.builder.EdgeState.calculateTargetConfigurations(EdgeState.java:173)
	at org.gradle.api.internal.artifacts.ivyservice.resolveengine.graph.builder.EdgeState.attachToTargetConfigurations(EdgeState.java:129)
	at org.gradle.api.internal.artifacts.ivyservice.resolveengine.graph.builder.DependencyGraphBuilder.attachToTargetRevisionsSerially(DependencyGraphBuilder.java:318)
	at org.gradle.api.internal.artifacts.ivyservice.resolveengine.graph.builder.DependencyGraphBuilder.resolveEdges(DependencyGraphBuilder.java:217)
	at org.gradle.api.internal.artifacts.ivyservice.resolveengine.graph.builder.DependencyGraphBuilder.traverseGraph(DependencyGraphBuilder.java:170)
	at org.gradle.api.internal.artifacts.ivyservice.resolveengine.graph.builder.DependencyGraphBuilder.resolve(DependencyGraphBuilder.java:131)
	at org.gradle.api.internal.artifacts.ivyservice.resolveengine.DefaultArtifactDependencyResolver.resolve(DefaultArtifactDependencyResolver.java:121)
	at org.gradle.api.internal.artifacts.ivyservice.DefaultConfigurationResolver.resolveGraph(DefaultConfigurationResolver.java:171)
	at org.gradle.api.internal.artifacts.ivyservice.ShortCircuitEmptyConfigurationResolver.resolveGraph(ShortCircuitEmptyConfigurationResolver.java:86)
	at org.gradle.api.internal.artifacts.ivyservice.ErrorHandlingConfigurationResolver.resolveGraph(ErrorHandlingConfigurationResolver.java:73)
	at org.gradle.api.internal.artifacts.configurations.DefaultConfiguration$7.run(DefaultConfiguration.java:580)
	at org.gradle.internal.operations.DefaultBuildOperationExecutor$RunnableBuildOperationWorker.execute(DefaultBuildOperationExecutor.java:301)
	at org.gradle.internal.operations.DefaultBuildOperationExecutor$RunnableBuildOperationWorker.execute(DefaultBuildOperationExecutor.java:293)
	at org.gradle.internal.operations.DefaultBuildOperationExecutor.execute(DefaultBuildOperationExecutor.java:175)
	at org.gradle.internal.operations.DefaultBuildOperationExecutor.run(DefaultBuildOperationExecutor.java:91)
	at org.gradle.internal.operations.DelegatingBuildOperationExecutor.run(DelegatingBuildOperationExecutor.java:31)
	at org.gradle.api.internal.artifacts.configurations.DefaultConfiguration.resolveGraphIfRequired(DefaultConfiguration.java:571)
	at org.gradle.api.internal.artifacts.configurations.DefaultConfiguration.access$600(DefaultConfiguration.java:135)
	at org.gradle.api.internal.artifacts.configurations.DefaultConfiguration$6.run(DefaultConfiguration.java:551)
	at org.gradle.api.internal.project.DefaultProjectStateRegistry$SafeExclusiveLockImpl.withLock(DefaultProjectStateRegistry.java:244)
	at org.gradle.api.internal.artifacts.configurations.DefaultConfiguration.resolveExclusively(DefaultConfiguration.java:547)
	at org.gradle.api.internal.artifacts.configurations.DefaultConfiguration.resolveToStateOrLater(DefaultConfiguration.java:542)
	at org.gradle.api.internal.artifacts.configurations.DefaultConfiguration.access$2200(DefaultConfiguration.java:135)
	at org.gradle.api.internal.artifacts.configurations.DefaultConfiguration$ConfigurationFileCollection.getSelectedArtifacts(DefaultConfiguration.java:1158)
	at org.gradle.api.internal.artifacts.configurations.DefaultConfiguration$ConfigurationFileCollection.getFiles(DefaultConfiguration.java:1147)
	... 52 more
```

---

<div class="post-metadata">

**Author:** ![zeusstl](https://avatars.discourse-cdn.com/v4/letter/z/d9b06d/32.png) [@zeusstl](https://devforum.zoom.us/u/zeusstl)\
**Post date:** [May 15, 2019, 4:42pm UTC](https://devforum.zoom.us/t/run-zoom-on-ionic-4/4250/5 "2019-05-15T16:42:23Z")

</div>

Let me know if I can help with any more info.

Do you think that this is something that Zoom will try to resolve?

---

<div class="post-metadata">

**Author:** ![carson.zoom](https://sea2.discourse-cdn.com/flex016/user_avatar/devforum.zoom.us/carson.zoom/32/785_2.png) [@carson.zoom](https://devforum.zoom.us/u/carson.zoom)\
**Post date:** [May 15, 2019, 6:05pm UTC](https://devforum.zoom.us/t/run-zoom-on-ionic-4/4250/6 "2019-05-15T18:05:16Z")

</div>

Hi,

Thanks for the error messages and the details! Really appreciate it!

Based on the error message, are you trying to run the Ionic SDK with emulator(The x86\_64 is for iOS simulator)? Our Ionic SDK only supports real device, it does not work with emulators at the moment.

Based on the description of the Ionic capacitor([https://capacitor.ionicframework.com/docs/basics/running-your-app](https://capacitor.ionicframework.com/docs/basics/running-your-app)), it is running using the emulators, I believe that’s the reason why you encounter with these errors.

Is the Ionic SDK works with Ionic 4 on real device?

If there is a demand, we will consider developing another Ionic SDK that supports simulators. The version with simulator supports will be much larger in size. It was not very demanding, that’s the reason why we don’t have the simulator version.

Hope this helps. Thanks!

---

<div class="post-metadata">

**Author:** ![zeusstl](https://avatars.discourse-cdn.com/v4/letter/z/d9b06d/32.png) [@zeusstl](https://devforum.zoom.us/u/zeusstl)\
**Post date:** [May 16, 2019, 4:15am UTC](https://devforum.zoom.us/t/run-zoom-on-ionic-4/4250/7 "2019-05-16T04:15:55Z")

</div>

Yes - I was trying to run it with the emulators. The errors on Android prevent the build from completing, so it cannot load on an emulator or a device. The errors on Ios I will try with a device as soon as possible.

To work without the emulator means that _all_ app development would need to be moved to a device, which is not really feasible for anyone.

I have a strong demand for Zoom, so that I can use Zoom in our app. I will find a solution and would be very happy if it was Zoom, since I will also use Zoom in other places if it works in the app.

---

<div class="post-metadata">

**Author:** ![zeusstl](https://avatars.discourse-cdn.com/v4/letter/z/d9b06d/32.png) [@zeusstl](https://devforum.zoom.us/u/zeusstl)\
**Post date:** [May 16, 2019, 4:18am UTC](https://devforum.zoom.us/t/run-zoom-on-ionic-4/4250/8 "2019-05-16T04:18:30Z")

</div>

Also, do you have any thoughts regarding the Android errors?

---

<div class="post-metadata">

**Author:** ![carson.zoom](https://sea2.discourse-cdn.com/flex016/user_avatar/devforum.zoom.us/carson.zoom/32/785_2.png) [@carson.zoom](https://devforum.zoom.us/u/carson.zoom)\
**Post date:** [May 16, 2019, 10:03pm UTC](https://devforum.zoom.us/t/run-zoom-on-ionic-4/4250/9 "2019-05-16T22:03:23Z")

</div>

Hi,

Thanks for the reply and I am glad that you like Zoom. I will forward the request of supporting emulators with the Ionic SDK to our engineers and we will add it in the future releases. Can you provide your `ionic info` print out and any version info? I will ensure the engineer to add your environment into the test cases in the future releases.

Please follow our Github repo for any updates.

Regarding the Android error, the root cause is because the library `commonlib` is missing:

```auto
Caused by: org.gradle.internal.resolve.ModuleVersionNotFoundException: Could not find :commonlib:.
Required by:
    project :app
    project :app > project :capacitor-cordova-android-plugins

```

How did you install our Ionic SDK?

Thanks!

---

<div class="post-metadata">

**Author:** ![zeusstl](https://avatars.discourse-cdn.com/v4/letter/z/d9b06d/32.png) [@zeusstl](https://devforum.zoom.us/u/zeusstl)\
**Post date:** [May 17, 2019, 3:37pm UTC](https://devforum.zoom.us/t/run-zoom-on-ionic-4/4250/10 "2019-05-17T15:37:46Z")

</div>

I installed the Zoom cordova plugin using the capacitor instructions for installing a cordova plugin:  
`npm install cordova.plugin.zoom`  
`npm install @ionic-native/zoom`

Then import it in app.component.ts, app.module.ts, and the component/directive where I need to use it:  
import { Zoom } from ‘@ionic-native/zoom/ngx’;

Then follow your instructions here:

> **[Ionic Documentation](https://ionicframework.com/docs/native/zoom)**
>
> Ionic is the app platform for web developers. Build amazing mobile, web, and desktop apps all with one shared code base and open web standards

ionic info:

```
Ionic:

   ionic (Ionic CLI) : 4.12.0 (/usr/local/lib/node_modules/ionic)
   Ionic Framework : @ionic/angular 4.2.0
   @angular-devkit/build-angular : 0.13.8
   @angular-devkit/schematics : 7.2.4
   @angular/cli : 7.2.4
   @ionic/angular-toolkit : 1.3.0

System:

   NodeJS : v10.15.1 (/usr/local/bin/node)
   npm : 6.8.0
   OS : macOS Mojave
```

---

<div class="post-metadata">

**Author:** ![zeusstl](https://avatars.discourse-cdn.com/v4/letter/z/d9b06d/32.png) [@zeusstl](https://devforum.zoom.us/u/zeusstl)\
**Post date:** [May 17, 2019, 4:59pm UTC](https://devforum.zoom.us/t/run-zoom-on-ionic-4/4250/11 "2019-05-17T16:59:43Z")

</div>

Any idea why the commonlib library would be missing based on the information I have shared?  
Or any recommendations how to resolve this issues?

---

<div class="post-metadata">

**Author:** ![carson.zoom](https://sea2.discourse-cdn.com/flex016/user_avatar/devforum.zoom.us/carson.zoom/32/785_2.png) [@carson.zoom](https://devforum.zoom.us/u/carson.zoom)\
**Post date:** [May 17, 2019, 8:07pm UTC](https://devforum.zoom.us/t/run-zoom-on-ionic-4/4250/12 "2019-05-17T20:07:48Z")

</div>

Hi,  
Thanks for the info. Seems like the installation steps are correct. I tried the same steps on my side and everything looks good. Regarding the commonlib issue, are you seeing the commonlib.aar file in the Ionic SDK’s lib folder? ([https://github.com/zoom/zoom-sdk-ionic/tree/master/libs/android](https://github.com/zoom/zoom-sdk-ionic/tree/master/libs/android)), if it is not there, you may download it from our Github and put it into the lib/android folder. If it is there, it might be the path is incorrect. I will ensure the engineer to look into this issue and get back to you.

Thanks!

---

<div class="post-metadata">

**Author:** ![zeusstl](https://avatars.discourse-cdn.com/v4/letter/z/d9b06d/32.png) [@zeusstl](https://devforum.zoom.us/u/zeusstl)\
**Post date:** [May 20, 2019, 1:49am UTC](https://devforum.zoom.us/t/run-zoom-on-ionic-4/4250/13 "2019-05-20T01:49:08Z")

</div>

Hello,

The commonlib file is where you said it should be.  
/project/node\_modules/cordova.plugin.zoom/libs/android $ ls  
commonlib.aar mobilertc.aar

Please let me know if the engineer has found any solutions. Thanks!

---

<div class="post-metadata">

**Author:** ![carson.zoom](https://sea2.discourse-cdn.com/flex016/user_avatar/devforum.zoom.us/carson.zoom/32/785_2.png) [@carson.zoom](https://devforum.zoom.us/u/carson.zoom)\
**Post date:** [May 20, 2019, 6:19pm UTC](https://devforum.zoom.us/t/run-zoom-on-ionic-4/4250/14 "2019-05-20T18:19:55Z")

</div>

Hi,  
Thanks for confirming the location of the library. We have very limited resource on this so we might need some time to troubleshoot this. I will get back to you as soon as possible.

Thanks!

---

<div class="post-metadata">

**Author:** ![zeusstl](https://avatars.discourse-cdn.com/v4/letter/z/d9b06d/32.png) [@zeusstl](https://devforum.zoom.us/u/zeusstl)\
**Post date:** [May 30, 2019, 2:35am UTC](https://devforum.zoom.us/t/run-zoom-on-ionic-4/4250/15 "2019-05-30T02:35:32Z")

</div>

Hi @carson.zoom,

Really appreciate your help so far. Just checking if there are any updates on troubleshooting this.

Thanks!

---

<div class="post-metadata">

**Author:** ![carson.zoom](https://sea2.discourse-cdn.com/flex016/user_avatar/devforum.zoom.us/carson.zoom/32/785_2.png) [@carson.zoom](https://devforum.zoom.us/u/carson.zoom)\
**Post date:** [May 30, 2019, 2:47am UTC](https://devforum.zoom.us/t/run-zoom-on-ionic-4/4250/16 "2019-05-30T02:47:58Z")

</div>

Hi,  
Thanks for the reply and the follow up. The engineering team is working on this and recently we have a lot of stuffs on the to-do list. I will keep pushing them and prioritize this work as much as I can.

Pardon the inconvenience. Will keep you updated. Thanks! 🙂

---

<div class="post-metadata">

**Author:** ![carson.zoom](https://sea2.discourse-cdn.com/flex016/user_avatar/devforum.zoom.us/carson.zoom/32/785_2.png) [@carson.zoom](https://devforum.zoom.us/u/carson.zoom)\
**Post date:** [June 27, 2019, 11:26pm UTC](https://devforum.zoom.us/t/run-zoom-on-ionic-4/4250/17 "2019-06-27T23:26:42Z")

</div>

Hi zeusstl,

Thanks for your reply. Just would like to give you a heads-up on the issue.

We are working on adding the simulator to our Ionic SDK and working on adding the support with Capacitor. We are expected to have the simulator support in the next release.

We have tested that our Ionic SDK actually works with Ionic 4(Ionic framework 4.6, Ionic CLI 5.2.0) on real device.

Below is the ionic info that we got the SDK working:

```auto
Ionic:

   Ionic CLI : 5.2.0 (/usr/local/lib/node_modules/ionic)
   Ionic Framework : @ionic/angular 4.6.0
   @angular-devkit/build-angular : 0.13.9
   @angular-devkit/schematics : 7.3.9
   @angular/cli : 7.3.9
   @ionic/angular-toolkit : 1.5.1

Cordova:

   Cordova CLI : 8.1.2 (cordova-lib@8.1.1)
   Cordova Platforms : android 7.1.4
   Cordova Plugins : cordova-plugin-ionic-keyboard 2.1.3, cordova-plugin-ionic-webview 4.1.1, (and 4 other plugins)

Utility:

   cordova-res : 0.5.1
   native-run : 0.2.7

System:

   ios-deploy : 1.9.4
   NodeJS : v8.12.0 (/usr/local/bin/node)
   npm : 6.7.0
   OS : macOS Mojave
   Xcode : Xcode 10.2.1 Build version 10E1001

```

And below is the dependencies in package.json that we got the SDK working:

```auto
"dependencies": {
    "@angular/common": "^7.2.2",
    "@angular/core": "^7.2.2",
    "@angular/forms": "^7.2.2",
    "@angular/http": "^7.2.2",
    "@angular/platform-browser": "^7.2.2",
    "@angular/platform-browser-dynamic": "^7.2.2",
    "@angular/router": "^7.2.2",
    "@ionic-native/core": "^5.8.0",
    "@ionic-native/splash-screen": "^5.0.0",
    "@ionic-native/status-bar": "^5.0.0",
    "@ionic-native/zoom": "^5.8.0",
    "@ionic/angular": "^4.1.0",
    "cordova-android": "7.1.4",
    "cordova-plugin-device": "^2.0.2",
    "cordova-plugin-ionic-keyboard": "^2.1.3",
    "cordova-plugin-ionic-webview": "^4.1.1",
    "cordova-plugin-splashscreen": "^5.0.2",
    "cordova-plugin-statusbar": "^2.4.2",
    "cordova-plugin-whitelist": "^1.3.3",
    "cordova.plugin.zoom": "^4.3.9440-1.325",
    "core-js": "^2.5.4",
    "rxjs": "~6.5.1",
    "tslib": "^1.9.0",
    "zone.js": "~0.8.29"
  },
  "devDependencies": {
    "@angular-devkit/architect": "~0.13.8",
    "@angular-devkit/build-angular": "~0.13.8",
    "@angular-devkit/core": "~7.3.8",
    "@angular-devkit/schematics": "~7.3.8",
    "@angular/cli": "~7.3.8",
    "@angular/compiler": "~7.2.2",
    "@angular/compiler-cli": "~7.2.2",
    "@angular/language-service": "~7.2.2",
    "@ionic/angular-toolkit": "~1.5.1",
    "@types/node": "~12.0.0",
    "@types/jasmine": "~2.8.8",
    "@types/jasminewd2": "~2.0.3",
    "codelyzer": "~4.5.0",
    "jasmine-core": "~2.99.1",
    "jasmine-spec-reporter": "~4.2.1",
    "karma": "~4.1.0",
    "karma-chrome-launcher": "~2.2.0",
    "karma-coverage-istanbul-reporter": "~2.0.1",
    "karma-jasmine": "~1.1.2",
    "karma-jasmine-html-reporter": "^0.2.2",
    "protractor": "~5.4.0",
    "ts-node": "~8.3.0",
    "tslint": "~5.17.0",
    "typescript": "~3.1.6"
  },

```

Hope this helps. Thanks!

---

<div class="post-metadata">

**Author:** ![travis.bradfield1](https://sea2.discourse-cdn.com/flex016/user_avatar/devforum.zoom.us/travis.bradfield1/32/5475_2.png) [@travis.bradfield1](https://devforum.zoom.us/u/travis.bradfield1)\
**Post date:** [April 8, 2020, 12:10pm UTC](https://devforum.zoom.us/t/run-zoom-on-ionic-4/4250/18 "2020-04-08T12:10:02Z")

</div>

Thanks for the updates!!

I’m still running into similar errors as @zeusstl was. I’m using Ionic 4 and Capacitor. Xcode build throws errors in the attached image.

 ![Screenshot 2020-04-08 at 13.09.49](https://us1.discourse-cdn.com/flex016/uploads/zoomdeveloper/original/2X/2/2d23675509c23760962fdd81e2dde7d3320ab0aa.png)

---

<div class="post-metadata">

**Author:** ![carson.zoom](https://sea2.discourse-cdn.com/flex016/user_avatar/devforum.zoom.us/carson.zoom/32/785_2.png) [@carson.zoom](https://devforum.zoom.us/u/carson.zoom)\
**Post date:** [April 9, 2020, 5:49am UTC](https://devforum.zoom.us/t/run-zoom-on-ionic-4/4250/19 "2020-04-09T05:49:22Z")

</div>

Hi [travis.bradfield1](https://devforum.zoom.us/u/travis.bradfield1),

Thanks for using Zoom SDK. Our Ionic SDK does not support Ionic Capacitor at the moment. However, if you would like to use it with Xcode, you may follow the instruction [https://marketplace.zoom.us/docs/sdk/native-sdks/iOS/getting-started/integration](https://marketplace.zoom.us/docs/sdk/native-sdks/iOS/getting-started/integration) to integrate the iOS framework into your Xcode so that the libraries and the frameworks could be correctly loaded.

Hope this helps. Thanks!

---

<div class="post-metadata">

**Author:** ![aqeel.o.ahmed](https://sea2.discourse-cdn.com/flex016/user_avatar/devforum.zoom.us/aqeel.o.ahmed/32/4220_2.png) [@aqeel.o.ahmed](https://devforum.zoom.us/u/aqeel.o.ahmed)\
**Post date:** [June 30, 2020, 7:07pm UTC](https://devforum.zoom.us/t/run-zoom-on-ionic-4/4250/20 "2020-06-30T19:07:36Z")

</div>

Hi,

I am also facing the same issue which zeuss faced.  
Using Cordova and ionic.  
The problem is how do we build it to test it on a real device if the build itself is failing with common lib and mobilertc not found error ?

Can you please help on this  
@Carson_Chen

---

<div class="post-metadata">

**Author:** ![DeveloperBot](https://sea2.discourse-cdn.com/flex016/user_avatar/devforum.zoom.us/developerbot/32/12632_2.png) [@DeveloperBot](https://devforum.zoom.us/u/DeveloperBot)\
**Post date:** [August 21, 2020, 10:30pm UTC](https://devforum.zoom.us/t/run-zoom-on-ionic-4/4250/21 "2020-08-21T22:30:55Z")

</div>


